BDBM472842 US10835536, Ex. Comp 52
SMILES COc1cc(OC)cc(c1)C#Cc1cn(C2CC(C2)C(=O)\C=C\CN(C)C)c2ncnc(N)c12
InChI Key InChIKey=GQGBIRDEANJQJM-AATRIKPKSA-N
Data  1 IC50
  Tab Delimited (TSV)   2D SDfile   Computed 3D by Vconf -m prep SDfile
Find this compound or compounds like it in BindingDB:
Activity Spreadsheet -- Enzyme Inhibition Constant Data from BindingDB
Found 1 hit for monomerid = 472842
TargetFibroblast growth factor receptor 2(Homo sapiens (Human))
Taiho Pharmaceutical
US Patent
LigandPNGBDBM472842(US10835536, Ex. Comp 52)
Affinity DataIC50:  1nM. Assay description: When setting conditions for the measurement of the inhibitory effect of the compounds on FGFR2 kinase activity, FL-Peptide 22 (Caliper Life Sciences,...
Ligand InfoPC cidPC sid
In DepthDetails US Patent