BDBM472876 4-fluoro-N-methyl-4-(((trans-2- phenylcyclopropyl)amino)methyl) cyclohexane-1-amine::US10836743, Compound A11
SMILES CNC1CCC(F)(CNC2CC2c2ccccc2)CC1
InChI Key InChIKey=WTRYSNWRQPIICD-UHFFFAOYSA-N
Data  3 IC50
  Tab Delimited (TSV)   2D SDfile   Computed 3D by Vconf -m prep SDfile
Find this compound or compounds like it in BindingDB:
Activity Spreadsheet -- Enzyme Inhibition Constant Data from BindingDB
Found 3 hits for monomerid = 472876
TargetLysine-specific histone demethylase 1A(Homo sapiens (Human))
Shanghai Institute Of Material Medica, Chinese Academy Of Sciences
US Patent
LigandPNGBDBM472876(4-fluoro-N-methyl-4-(((trans-2- phenylcyclopropyl)...)
Affinity DataIC50:  9.5nM. Assay description: Screening method: lysine-specific demethylase 1 (LSD1) activity screeningInstrument: microplate reader Envision™ (PerkinElmer, USA).MATERIALS: Human ...
Ligand InfoPC cidPC sid
In DepthDetails US Patent
TargetAmine oxidase [flavin-containing] B(Homo sapiens (Human))
Shanghai Institute Of Material Medica, Chinese Academy Of Sciences
US Patent
LigandPNGBDBM472876(4-fluoro-N-methyl-4-(((trans-2- phenylcyclopropyl)...)
Affinity DataIC50: >1.00E+5nM. Assay description: Screening method: Monoamine oxidase MAOA and MAOB activity screeningInstrument: microplate reader Envision™ (PerkinElmer, USA).MATERIALS: Human recom...
Ligand InfoPC cidPC sid
In DepthDetails US Patent
TargetAmine oxidase [flavin-containing] A(Homo sapiens (Human))
Shanghai Institute Of Material Medica, Chinese Academy Of Sciences
US Patent
LigandPNGBDBM472876(4-fluoro-N-methyl-4-(((trans-2- phenylcyclopropyl)...)
Affinity DataIC50: >1.00E+5nM. Assay description: Screening method: Monoamine oxidase MAOA and MAOB activity screeningInstrument: microplate reader Envision™ (PerkinElmer, USA).MATERIALS: Human recom...
Ligand InfoPC cidPC sid
In DepthDetails US Patent