BDBM472888 N-((4-fluoro-1-(naphthyl-2-methyl) piperidin-4-yl)methyl)-trans-2- phenylcyclopropylamine::US10836743, Compound A17
SMILES FC1(CNC2CC2c2ccccc2)CCN(Cc2ccc3ccccc3c2)CC1
InChI Key InChIKey=XYWOWZOWZMZFJW-UHFFFAOYSA-N
Data  3 IC50
  Tab Delimited (TSV)   2D SDfile   Computed 3D by Vconf -m prep SDfile
Find this compound or compounds like it in BindingDB:
Activity Spreadsheet -- Enzyme Inhibition Constant Data from BindingDB
Found 3 hits for monomerid = 472888
TargetLysine-specific histone demethylase 1A(Homo sapiens (Human))
Shanghai Institute Of Material Medica, Chinese Academy Of Sciences
US Patent
LigandPNGBDBM472888(N-((4-fluoro-1-(naphthyl-2-methyl) piperidin-4-yl)...)
Affinity DataIC50:  49nM. Assay description: Screening method: lysine-specific demethylase 1 (LSD1) activity screeningInstrument: microplate reader Envision™ (PerkinElmer, USA).MATERIALS: Human ...
Ligand InfoPC cidPC sid
In DepthDetails US Patent
TargetAmine oxidase [flavin-containing] B(Homo sapiens (Human))
Shanghai Institute Of Material Medica, Chinese Academy Of Sciences
US Patent
LigandPNGBDBM472888(N-((4-fluoro-1-(naphthyl-2-methyl) piperidin-4-yl)...)
Affinity DataIC50:  3.95E+3nM. Assay description: Screening method: Monoamine oxidase MAOA and MAOB activity screeningInstrument: microplate reader Envision™ (PerkinElmer, USA).MATERIALS: Human recom...
Ligand InfoPC cidPC sid
In DepthDetails US Patent
TargetAmine oxidase [flavin-containing] A(Homo sapiens (Human))
Shanghai Institute Of Material Medica, Chinese Academy Of Sciences
US Patent
LigandPNGBDBM472888(N-((4-fluoro-1-(naphthyl-2-methyl) piperidin-4-yl)...)
Affinity DataIC50: >1.00E+5nM. Assay description: Screening method: Monoamine oxidase MAOA and MAOB activity screeningInstrument: microplate reader Envision™ (PerkinElmer, USA).MATERIALS: Human recom...
Ligand InfoPC cidPC sid
In DepthDetails US Patent