BDBM472970 US10836758, Example 59
SMILES NC1CCC(CCOc2cc(F)c(cc2F)S(=O)(=O)Nc2ncns2)(CC1)c1ccc(Cl)cc1
InChI Key InChIKey=USIAWHSRJOGWQW-UHFFFAOYSA-N
Data  1 IC50
  Tab Delimited (TSV)   2D SDfile   Computed 3D by Vconf -m prep SDfile
Find this compound or compounds like it in BindingDB:
Activity Spreadsheet -- Enzyme Inhibition Constant Data from BindingDB
Found 1 hit for monomerid = 472970
TargetSodium channel protein type 9 subunit alpha(Homo sapiens (Human))
Bristol-Myers Squibb
US Patent
LigandPNGBDBM472970(US10836758, Example 59)
Affinity DataIC50:  8nM. Assay description: hNaV1.7 binding affinities were determined with a filtration binding assay using purified membranes from HEK293 cells stably expressing hNaV1.7. HEK2...
Ligand InfoPC cidPC sid
In DepthDetails US Patent