BDBM473022 5-(2-((3,3-difluoro-14(2-methyl-2H-1,2,3-triazol-4-yl)cyclobutyl)amino)-2-oxoacetyl)-N-4(4-fluorophenyl)-6-methyl-2,3-dihydro-1H-pyrrolizine-7-carboxamide::US10836769, Example 9
SMILES Cc1c(C(=O)Nc2ccc(F)cc2)c2CCCn2c1C(=O)C(=O)NC1(CC(F)(F)C1)c1cnn(C)n1
InChI Key InChIKey=WLWWAGIRANUITH-UHFFFAOYSA-N
Data  1 EC50
  Tab Delimited (TSV)   2D SDfile   Computed 3D by Vconf -m prep SDfile
Find this compound or compounds like it in BindingDB:
Activity Spreadsheet -- Enzyme Inhibition Constant Data from BindingDB
Found 1 hit for monomerid = 473022
TargetCapsid protein(Hepatitis B virus genotype C subtype ayr (isolate ...)
Gilead Sciences
US Patent
LigandPNGBDBM473022(5-(2-((3,3-difluoro-14(2-methyl-2H-1,2,3-triazol-4...)
Affinity DataEC50:  5.80nM. Assay description: A HepG2 cell line overexpressing the HBV virus attachment receptor sodium-taurocholate cotransporting polypeptide (NTCP) was grown to confluency in D...
Ligand InfoPC cidPC sid
In DepthDetails US Patent