BDBM473043 US10836769, Example 29
SMILES Cc1c(C(=O)Nc2cc(F)c(F)c(F)c2)c2CCCn2c1C(=O)C(=O)NC1(CC1)c1nncs1
InChI Key InChIKey=WJPFOJIHMUNDTK-UHFFFAOYSA-N
Data  1 EC50
  Tab Delimited (TSV)   2D SDfile   Computed 3D by Vconf -m prep SDfile
Find this compound or compounds like it in BindingDB:
Activity Spreadsheet -- Enzyme Inhibition Constant Data from BindingDB
Found 1 hit for monomerid = 473043
TargetCapsid protein(Hepatitis B virus genotype C subtype ayr (isolate ...)
Gilead Sciences
US Patent
LigandPNGBDBM473043(US10836769, Example 29)
Affinity DataEC50:  14.3nM. Assay description: A HepG2 cell line overexpressing the HBV virus attachment receptor sodium-taurocholate cotransporting polypeptide (NTCP) was grown to confluency in D...
Ligand InfoPC cidPC sid
In DepthDetails US Patent