BDBM473056 US10836769, Example 42
SMILES CNC(=O)C1(CC(F)(F)C1)NC(=O)C(=O)c1c(C)c(C(=O)Nc2cc(F)c(F)c(F)c2)c2CCCn12
InChI Key InChIKey=QWOQLQLDANTUPW-UHFFFAOYSA-N
Data  1 EC50
  Tab Delimited (TSV)   2D SDfile   Computed 3D by Vconf -m prep SDfile
Find this compound or compounds like it in BindingDB:
Activity Spreadsheet -- Enzyme Inhibition Constant Data from BindingDB
Found 1 hit for monomerid = 473056
TargetCapsid protein(Hepatitis B virus genotype C subtype ayr (isolate ...)
Gilead Sciences
US Patent
LigandPNGBDBM473056(US10836769, Example 42)
Affinity DataEC50:  12.7nM. Assay description: A HepG2 cell line overexpressing the HBV virus attachment receptor sodium-taurocholate cotransporting polypeptide (NTCP) was grown to confluency in D...
Ligand InfoPC cidPC sid
In DepthDetails US Patent