BDBM473068 US10836769, Example 54
SMILES Fc1ccc(NC(=O)c2c(Cl)c(C(=O)C(=O)NC3(CC(F)(F)C3)c3c[nH]nn3)n3CCCc23)cc1F
InChI Key InChIKey=AVOGZMNKISRKOW-UHFFFAOYSA-N
Data  1 EC50
  Tab Delimited (TSV)   2D SDfile   Computed 3D by Vconf -m prep SDfile
Find this compound or compounds like it in BindingDB:
Activity Spreadsheet -- Enzyme Inhibition Constant Data from BindingDB
Found 1 hit for monomerid = 473068
TargetCapsid protein(Hepatitis B virus genotype C subtype ayr (isolate ...)
Gilead Sciences
US Patent
LigandPNGBDBM473068(US10836769, Example 54)
Affinity DataEC50:  1.60nM. Assay description: A HepG2 cell line overexpressing the HBV virus attachment receptor sodium-taurocholate cotransporting polypeptide (NTCP) was grown to confluency in D...
Ligand InfoPC cidPC sid
In DepthDetails US Patent