BDBM473075 7-{8-[(5,6- dimethoxypyridin-2- yl)amino]imidazo[1,2- a]pyridin-6- yl}quinoxalin-2-ol::US10842803, Structure TABLE 1.5
SMILES COc1ccc(Nc2cc(cn3ccnc23)-c2ccc3ncc(O)nc3c2)nc1OC
InChI Key InChIKey=XPKXLBASWYFXNT-UHFFFAOYSA-N
Data  1 IC50
  Tab Delimited (TSV)   2D SDfile   Computed 3D by Vconf -m prep SDfile
Find this compound or compounds like it in BindingDB:
Activity Spreadsheet -- Enzyme Inhibition Constant Data from BindingDB
Found 1 hit for monomerid = 473075
TargetTyrosine-protein kinase SYK(Homo sapiens (Human))
Kronos Bio
US Patent
LigandPNGBDBM473075(7-{8-[(5,6- dimethoxypyridin-2- yl)amino]imidazo[1...)
Affinity DataIC50:  2.24E+4nM. Assay description: A master mix minus Syk enzyme is prepared containing 1X Cell Signaling kinase buffer (25 mM Tris-HCl, pH 7.5, 5 mM beta-glycerophosphate, 2 mM dithio...
Ligand InfoPC cidPC sid
In DepthDetails US Patent