BDBM473081 1,5-dimethyl-N-[6-(1- methyl-1H-1,3- benzodiazol-6- yl)imidazo[1,2- a]pyridin-8-yl]-1H- pyrazol-3-amine::US10842803, Structure TABLE 1.11
SMILES Cc1cc(Nc2cc(cn3ccnc23)-c2ccc3ncn(C)c3c2)nn1C
InChI Key InChIKey=KIBZCINERGLGHA-UHFFFAOYSA-N
Data  1 IC50
  Tab Delimited (TSV)   2D SDfile   Computed 3D by Vconf -m prep SDfile
Find this compound or compounds like it in BindingDB:
Activity Spreadsheet -- Enzyme Inhibition Constant Data from BindingDB
Found 1 hit for monomerid = 473081
TargetTyrosine-protein kinase SYK(Homo sapiens (Human))
Kronos Bio
US Patent
LigandPNGBDBM473081(1,5-dimethyl-N-[6-(1- methyl-1H-1,3- benzodiazol-6...)
Affinity DataIC50:  1.82E+5nM. Assay description: A master mix minus Syk enzyme is prepared containing 1X Cell Signaling kinase buffer (25 mM Tris-HCl, pH 7.5, 5 mM beta-glycerophosphate, 2 mM dithio...
Ligand InfoPC cidPC sid
In DepthDetails US Patent