BDBM473127 2-(6-(8-(6,7-dihydro-4H- pyrazolo[5,1- c][1,4]oxazin-2- ylamino)imidazo[1,2- a]pyridin-6-yl)-1H- indol-3-yl)ethanol::US10842803, Structure TABLE 1.57
SMILES OCCc1c[nH]c2cc(ccc12)-c1cc(Nc2cc3COCCn3n2)c2nccn2c1
InChI Key InChIKey=UJLCAUDXTUPBJP-UHFFFAOYSA-N
Data  1 IC50
  Tab Delimited (TSV)   2D SDfile   Computed 3D by Vconf -m prep SDfile
Find this compound or compounds like it in BindingDB:
Activity Spreadsheet -- Enzyme Inhibition Constant Data from BindingDB
Found 1 hit for monomerid = 473127
TargetTyrosine-protein kinase SYK(Homo sapiens (Human))
Kronos Bio
US Patent
LigandPNGBDBM473127(2-(6-(8-(6,7-dihydro-4H- pyrazolo[5,1- c][1,4]oxaz...)
Affinity DataIC50:  7.10E+3nM. Assay description: A master mix minus Syk enzyme is prepared containing 1X Cell Signaling kinase buffer (25 mM Tris-HCl, pH 7.5, 5 mM beta-glycerophosphate, 2 mM dithio...
Ligand InfoPC cidPC sid
In DepthDetails US Patent