BDBM473159 6-(5-chloro-8-(5-(4- isopropylpiperazin-1- yl)pyridin-2- ylamino)imidazo[1,2- a]pyridin-6-yl)indolin-2- one::US10842803, Structure TABLE 1.89
SMILES CC(C)N1CCN(CC1)c1ccc(Nc2cc(c(Cl)n3ccnc23)-c2ccc3CC(=O)Nc3c2)nc1
InChI Key InChIKey=QWTXOMHDNPKELH-UHFFFAOYSA-N
Data  1 IC50
  Tab Delimited (TSV)   2D SDfile   Computed 3D by Vconf -m prep SDfile
Find this compound or compounds like it in BindingDB:
Activity Spreadsheet -- Enzyme Inhibition Constant Data from BindingDB
Found 1 hit for monomerid = 473159
TargetTyrosine-protein kinase SYK(Homo sapiens (Human))
Kronos Bio
US Patent
LigandPNGBDBM473159(6-(5-chloro-8-(5-(4- isopropylpiperazin-1- yl)pyri...)
Affinity DataIC50:  1.70E+4nM. Assay description: A master mix minus Syk enzyme is prepared containing 1X Cell Signaling kinase buffer (25 mM Tris-HCl, pH 7.5, 5 mM beta-glycerophosphate, 2 mM dithio...
Ligand InfoPC cidPC sid
In DepthDetails US Patent