BDBM473249 US10844044, Example 197
SMILES CCn1cc(c(n1)C(F)(F)F)-c1cc(Cn2ccn(C3CC3)c2=N)cc(c1)C(=O)NCc1ccc(F)c(C)c1
InChI Key InChIKey=JDDQROKCFHICFG-UHFFFAOYSA-N
Data  1 KI
  Tab Delimited (TSV)   2D SDfile   Computed 3D by Vconf -m prep SDfile
Find this compound or compounds like it in BindingDB:
Activity Spreadsheet -- Enzyme Inhibition Constant Data from BindingDB
Found 1 hit for monomerid = 473249
TargetWD repeat-containing protein 5(Homo sapiens (Human))
Vanderbilt University
US Patent
LigandPNGBDBM473249(US10844044, Example 197)
Affinity DataKi: <0.100nM. Assay description: A Time-Resolved Fluorescence Resonance Energy Transfer (TR-FRET) assay that measures the displacement of the 10mer-Thr-FAM probe in response to compo...
Ligand InfoPC cidPC sid
In DepthDetails US Patent