BDBM473577 US10844062, Example 13
SMILES CC1CCN(CC1)c1cc(cc(c1)C(F)(F)F)C(=O)Nc1ccc(F)c(Nc2ncccc2-c2ncnc3[nH]cnc23)c1F
InChI Key InChIKey=QRGDKNYQLRPRSJ-UHFFFAOYSA-N
Data  1 IC50
  Tab Delimited (TSV)   2D SDfile   Computed 3D by Vconf -m prep SDfile
Find this compound or compounds like it in BindingDB:
Activity Spreadsheet -- Enzyme Inhibition Constant Data from BindingDB
Found 1 hit for monomerid = 473577
TargetVascular endothelial growth factor receptor 2(Homo sapiens (Human))
Incheon University Industry Academic Cooperation Foundation
US Patent
LigandPNGBDBM473577(US10844062, Example 13)
Affinity DataIC50:  6.05E+3nM. Assay description: The inhibitory activities of the compounds of the present invention against VEGFR-2 tyrosine kinase were analyzed using ADP-Glo™ kinase assay kit com...
Ligand InfoPC cidPC sid
In DepthDetails US Patent