BDBM473627 US10844062, Example 63
SMILES COc1cc(cc(c1)C(F)(F)F)C(=O)Nc1cc(Nc2ncccc2-c2ncnc3[nH]cnc23)ccc1F
InChI Key InChIKey=VIADEFCKHSOZHF-UHFFFAOYSA-N
Data  1 IC50
  Tab Delimited (TSV)   2D SDfile   Computed 3D by Vconf -m prep SDfile
Find this compound or compounds like it in BindingDB:
Activity Spreadsheet -- Enzyme Inhibition Constant Data from BindingDB
Found 1 hit for monomerid = 473627
TargetVascular endothelial growth factor receptor 2(Homo sapiens (Human))
Incheon University Industry Academic Cooperation Foundation
US Patent
LigandPNGBDBM473627(US10844062, Example 63)
Affinity DataIC50:  1.10E+3nM. Assay description: The inhibitory activities of the compounds of the present invention against VEGFR-2 tyrosine kinase were analyzed using ADP-Glo™ kinase assay kit com...
Ligand InfoPC cidPC sid
In DepthDetails US Patent