BDBM473640 US10844062, Example 76
SMILES Fc1ccc(Nc2ncccc2-c2ncnc3[nH]cnc23)cc1NC(=O)Cc1cccc(c1)C(F)(F)F
InChI Key InChIKey=KHRSPHGMPQKXQG-UHFFFAOYSA-N
Data  1 IC50
  Tab Delimited (TSV)   2D SDfile   Computed 3D by Vconf -m prep SDfile
Find this compound or compounds like it in BindingDB:
Activity Spreadsheet -- Enzyme Inhibition Constant Data from BindingDB
Found 1 hit for monomerid = 473640
TargetVascular endothelial growth factor receptor 2(Homo sapiens (Human))
Incheon University Industry Academic Cooperation Foundation
US Patent
LigandPNGBDBM473640(US10844062, Example 76)
Affinity DataIC50:  11nM. Assay description: The inhibitory activities of the compounds of the present invention against VEGFR-2 tyrosine kinase were analyzed using ADP-Glo™ kinase assay kit com...
Ligand InfoPC cidPC sid
In DepthDetails US Patent