BDBM473650 US10844062, Example 86
SMILES CC(C)(C#N)c1cccc(c1)C(=O)Nc1cccc(Nc2ncccc2-c2ncnc3[nH]ccc23)c1F
InChI Key InChIKey=QAWSLMCFHBHJFZ-UHFFFAOYSA-N
Data  1 IC50
  Tab Delimited (TSV)   2D SDfile   Computed 3D by Vconf -m prep SDfile
Find this compound or compounds like it in BindingDB:
Activity Spreadsheet -- Enzyme Inhibition Constant Data from BindingDB
Found 1 hit for monomerid = 473650
TargetVascular endothelial growth factor receptor 2(Homo sapiens (Human))
Incheon University Industry Academic Cooperation Foundation
US Patent
LigandPNGBDBM473650(US10844062, Example 86)
Affinity DataIC50:  1.55E+3nM. Assay description: The inhibitory activities of the compounds of the present invention against VEGFR-2 tyrosine kinase were analyzed using ADP-Glo™ kinase assay kit com...
Ligand InfoPC cidPC sid
In DepthDetails US Patent