BDBM473726 3-[4-Amino-3-(3-chloro-1H-pyrrolo[2,3- b]pyridin-2-yl)pyrazolo[3,4-d]pyrimidin-1- yl]cyclopentanol::US10844067, Example 69::US11661423, Example 69
SMILES Nc1ncnc2n(nc(-c3[nH]c4ncccc4c3Cl)c12)C1CCC(O)C1
InChI Key
Data  6 IC50
  Tab Delimited (TSV)   2D SDfile   Computed 3D by Vconf -m prep SDfile
Find this compound or compounds like it in BindingDB:
Activity Spreadsheet -- Enzyme Inhibition Constant Data from BindingDB
Found 6 hits for monomerid = 473726
TargetProto-oncogene tyrosine-protein kinase receptor Ret(Homo sapiens (Human))
Cancer Research Technology
US Patent
LigandPNGBDBM473726(3-[4-Amino-3-(3-chloro-1H-pyrrolo[2,3- b]pyridin-2...)
Affinity DataIC50:  1.20nM. Assay description: RET and KDR: Kinase activity was detected using CisBio HTRF kinEASE kit based on time-resolved fluorescence transfer (FRET). The assay was performed ...
Ligand InfoPC cidPC sid
In DepthDetails US Patent
TargetVascular endothelial growth factor receptor 2(Homo sapiens (Human))
Cancer Research Technology
US Patent
LigandPNGBDBM473726(3-[4-Amino-3-(3-chloro-1H-pyrrolo[2,3- b]pyridin-2...)
Affinity DataIC50:  657nM. Assay description: RET and KDR: Kinase activity was detected using CisBio HTRF kinEASE kit based on time-resolved fluorescence transfer (FRET). The assay was performed ...
Ligand InfoPC cidPC sid
In DepthDetails US Patent
TargetProto-oncogene tyrosine-protein kinase receptor Ret [V804M](Homo sapiens (Human))
Cancer Research Technology
US Patent
LigandPNGBDBM473726(3-[4-Amino-3-(3-chloro-1H-pyrrolo[2,3- b]pyridin-2...)
Affinity DataIC50:  19.1nM. Assay description: Kinase activity was detected using CisBio HTRF kinEASE kit based on time-resolved fluorescence transfer (FRET). The assay was performed in 384-well w...
Ligand InfoPC cidPC sid
In DepthDetails US Patent
TargetProto-oncogene tyrosine-protein kinase receptor Ret(Homo sapiens (Human))
Cancer Research Technology
US Patent
LigandPNGBDBM473726(3-[4-Amino-3-(3-chloro-1H-pyrrolo[2,3- b]pyridin-2...)
Affinity DataIC50:  1.20nM. Assay description: Kinase activity was detected using CisBio HTRF kinEASE kit based on time-resolved fluorescence transfer (FRET). The assay was performed in 384-well w...
Ligand InfoPC cidPC sid
In DepthDetails US Patent
TargetVascular endothelial growth factor receptor 2(Homo sapiens (Human))
Cancer Research Technology
US Patent
LigandPNGBDBM473726(3-[4-Amino-3-(3-chloro-1H-pyrrolo[2,3- b]pyridin-2...)
Affinity DataIC50:  657nM. Assay description: Kinase activity was detected using CisBio HTRF kinEASE kit based on time-resolved fluorescence transfer (FRET). The assay was performed in 384-well w...
Ligand InfoPC cidPC sid
In DepthDetails US Patent
TargetProto-oncogene tyrosine-protein kinase receptor Ret [V804M](Homo sapiens (Human))
Cancer Research Technology
US Patent
LigandPNGBDBM473726(3-[4-Amino-3-(3-chloro-1H-pyrrolo[2,3- b]pyridin-2...)
Affinity DataIC50:  19.1nM. Assay description: RET and KDR: Kinase activity was detected using CisBio HTRF kinEASE kit based on time-resolved fluorescence transfer (FRET). The assay was performed ...
Ligand InfoPC cidPC sid
In DepthDetails US Patent