BDBM473975 US10858344, Example 83
SMILES CC[C@@](O)(CNS(=O)(=O)CCCCN1CC(=O)NC1=O)c1ccc(F)c(OCC(C)C)c1
InChI Key InChIKey=PPXSSCFSKGKPSV-OAQYLSRUSA-N
Data  1 IC50
  Tab Delimited (TSV)   2D SDfile   Computed 3D by Vconf -m prep SDfile
Find this compound or compounds like it in BindingDB:
Activity Spreadsheet -- Enzyme Inhibition Constant Data from BindingDB
Found 1 hit for monomerid = 473975
TargetDeoxyuridine 5'-triphosphate nucleotidohydrolase, mitochondrial(Homo sapiens (Human))
CV6 Therapeutics (NI)
US Patent
LigandPNGBDBM473975(US10858344, Example 83)
Affinity DataIC50:  2.00E+3nM. Assay description: The assay employs a DNA polymerase-based approach utilizing an oligonucleotide template with 3 distinct regions: a 3′ primer binding region, a ...
Ligand InfoPC cidPC sid
In DepthDetails US Patent