BDBM474147 7-(3-fluorobenzyl)-6-methyl-3-(2- methylcyclopropyl)imidazo[1,5- a]pyrazin-8(7H)-one, stereoisomer 3::US10858362, Example 35, isomer 3::US10905688, Example 35, isomer 3::US11472810, Example 35, isomer 3
SMILES C[C@H]1C[C@@H]1c1ncc2n1cc(C)n(Cc1cccc(F)c1)c2=O
InChI Key InChIKey=NSFYZWGFIIQKQP-NHYWBVRUSA-N
Data  9 IC50
  Tab Delimited (TSV)   2D SDfile   Computed 3D by Vconf -m prep SDfile
Find this compound or compounds like it in BindingDB:
Activity Spreadsheet -- Enzyme Inhibition Constant Data from BindingDB
Found 9 hits for monomerid = 474147
LigandPNGBDBM474147(7-(3-fluorobenzyl)-6-methyl-3-(2- methylcyclopropy...)
Affinity DataIC50:  82nM. Assay description: PDE1A, PDE1B and PDE1C assays were performed as follows: the assays was performed in 60 μL samples containing a fixed amount of the PDE1 enzyme ...
Ligand InfoPC cidPC sid
In DepthDetails US Patent
LigandPNGBDBM474147(7-(3-fluorobenzyl)-6-methyl-3-(2- methylcyclopropy...)
Affinity DataIC50:  18nM. Assay description: PDE1A, PDE1B and PDE1C assays were performed as follows: the assays was performed in 60 μL samples containing a fixed amount of the PDE1 enzyme ...
Ligand InfoPC cidPC sid
In DepthDetails US Patent
LigandPNGBDBM474147(7-(3-fluorobenzyl)-6-methyl-3-(2- methylcyclopropy...)
Affinity DataIC50:  8nM. Assay description: PDE1A, PDE1B and PDE1C assays were performed as follows: the assays was performed in 60 μL samples containing a fixed amount of the PDE1 enzyme ...
Ligand InfoPC cidPC sid
In DepthDetails US Patent
LigandPNGBDBM474147(7-(3-fluorobenzyl)-6-methyl-3-(2- methylcyclopropy...)
Affinity DataIC50:  82nM. Assay description: PDE1A, PDE1B and PDE1C assays were performed as follows: the assays was performed in 60 μL samples containing a fixed amount of the PDE1 enzyme ...
Ligand InfoPC cidPC sid
In DepthDetails US Patent
LigandPNGBDBM474147(7-(3-fluorobenzyl)-6-methyl-3-(2- methylcyclopropy...)
Affinity DataIC50:  8nM
Ligand InfoPC cidPC sid
In DepthDetails US Patent
LigandPNGBDBM474147(7-(3-fluorobenzyl)-6-methyl-3-(2- methylcyclopropy...)
Affinity DataIC50:  8nM. Assay description: PDE1A, PDE1B and PDE1C assays were performed as follows: the assays was performed in 60 μL samples containing a fixed amount of the PDE1 enzyme ...
Ligand InfoPC cidPC sid
In DepthDetails US Patent
LigandPNGBDBM474147(7-(3-fluorobenzyl)-6-methyl-3-(2- methylcyclopropy...)
Affinity DataIC50:  82nM. Assay description: PDE1A, PDE1B and PDE1C assays were performed as follows: the assays was performed in 60 μL samples containing a fixed amount of the PDE1 enzym1 ...
Ligand InfoPC cidPC sid
In DepthDetails US Patent
LigandPNGBDBM474147(7-(3-fluorobenzyl)-6-methyl-3-(2- methylcyclopropy...)
Affinity DataIC50:  18nM
Ligand InfoPC cidPC sid
In DepthDetails US Patent
LigandPNGBDBM474147(7-(3-fluorobenzyl)-6-methyl-3-(2- methylcyclopropy...)
Affinity DataIC50:  18nM. Assay description: PDE1A, PDE1B and PDE1C assays were performed as follows: the assays was performed in 60 μL samples containing a fixed amount of the PDE1 enzyme ...
Ligand InfoPC cidPC sid
In DepthDetails US Patent