BDBM474328 7-(4-fluorophenyl)-2-(2-methoxyethyl)-8-(3-met hylimidazo[1,2-a]pyridin-6-yl)-[1,2,4]triazolo[ 1, 5-c]pyrimidin-5-amine::US10858365, Compound 114
SMILES COCCc1nc2c(-c3ccc4ncc(C)n4c3)c(nc(N)n2n1)-c1ccc(F)cc1
InChI Key InChIKey=AKTXUNFJKSXMRB-UHFFFAOYSA-N
Data  4 IC50
  Tab Delimited (TSV)   2D SDfile   Computed 3D by Vconf -m prep SDfile
Find this compound or compounds like it in BindingDB:
Activity Spreadsheet -- Enzyme Inhibition Constant Data from BindingDB
Found 4 hits for monomerid = 474328
TargetAdenosine receptor A2a(Homo sapiens (Human))
TBA
US Patent
LigandPNGBDBM474328(7-(4-fluorophenyl)-2-(2-methoxyethyl)-8-(3-met hyl...)
Affinity DataIC50:  0.200nM. Assay description: The compounds at different concentrations were incubate with hA1 membrane (from PerkinElmer) and [3H]-8-Cyclopentyl-1,3-dipropylxanthine (DPCPX) for ...
Ligand InfoPC cidPC sid
In DepthDetails US Patent
TargetAdenosine receptor A1(Homo sapiens (Human))
TBA
US Patent
LigandPNGBDBM474328(7-(4-fluorophenyl)-2-(2-methoxyethyl)-8-(3-met hyl...)
Affinity DataIC50:  5.70nM. Assay description: hADORA1/CHO (hA1 expressing) cells (Genscript) were plated at 1×104 cells/well into 384-well polystyrene plates one day before starting the experimen...
Ligand InfoPC cidPC sid
In DepthDetails US Patent
TargetAdenosine receptor A2a(Mus musculus)
TBA
US Patent
LigandPNGBDBM474328(7-(4-fluorophenyl)-2-(2-methoxyethyl)-8-(3-met hyl...)
Affinity DataIC50:  0.400nM. Assay description: hADORA1/CHO (hA1 expressing) cells (Genscript) were plated at 1×104 cells/well into 384-well polystyrene plates one day before starting the experimen...
Ligand InfoPC cidPC sid
In DepthDetails US Patent
TargetAdenosine receptor A2b(Homo sapiens (Human))
TBA
US Patent
LigandPNGBDBM474328(7-(4-fluorophenyl)-2-(2-methoxyethyl)-8-(3-met hyl...)
Affinity DataIC50:  40.9nM. Assay description: hADORA1/CHO (hA1 expressing) cells (Genscript) were plated at 1×104 cells/well into 384-well polystyrene plates one day before starting the experimen...
Ligand InfoPC cidPC sid
In DepthDetails US Patent