BDBM474379 6-benzhydryl-11-hydroxy-6H,10H- spiro[imidazo[1,2-d]pyrido[2,1- f][1,2,4]triazine-5,3'-oxetan]-10-one::US10858366, Example 79
SMILES Oc1c2-c3nccn3C3(COC3)N(C(c3ccccc3)c3ccccc3)n2ccc1=O
InChI Key InChIKey=VLYMAFLOIZMPQV-UHFFFAOYSA-N
Data  3 EC50
  Tab Delimited (TSV)   2D SDfile   Computed 3D by Vconf -m prep SDfile
Find this compound or compounds like it in BindingDB:
Activity Spreadsheet -- Enzyme Inhibition Constant Data from BindingDB
Found 3 hits for monomerid = 474379
TargetNeuraminidase(Influenza A virus (strain A/Wilson-Smith/1933 H1N1...)
Novartis
US Patent
LigandPNGBDBM474379(6-benzhydryl-11-hydroxy-6H,10H- spiro[imidazo[1,2-...)
Affinity DataEC50:  610nM. Assay description: For influenza NA assays, MDCK cells were plated in Phenol Red-free DMEM (Gibco) supplemented with 2 mM L-Glutamine, 1% sodium pyruvate (Cellgro, Mana...
Ligand InfoPC cidPC sid
In DepthDetails US Patent
TargetNeuraminidase()
Novartis
US Patent
LigandPNGBDBM474379(6-benzhydryl-11-hydroxy-6H,10H- spiro[imidazo[1,2-...)
Affinity DataEC50:  390nM
Ligand InfoPC cidPC sid
In DepthDetails US Patent
TargetNeuraminidase(Influenza A virus (strain A/Memphis/1/1971 H3N2))
Novartis
US Patent
LigandPNGBDBM474379(6-benzhydryl-11-hydroxy-6H,10H- spiro[imidazo[1,2-...)
Affinity DataEC50:  1.50E+3nM
Ligand InfoPC cidPC sid
In DepthDetails US Patent