BDBM474388 US10858368, Entry 8::US11319327, Entry 8
SMILES Cc1nc2cccc(N3CCN(CCC4CC5(CCN(CC5)S(C)(=O)=O)C(=O)O4)CC3)c2[nH]1
InChI Key
Data  2 IC50
  Tab Delimited (TSV)   2D SDfile   Computed 3D by Vconf -m prep SDfile
Find this compound or compounds like it in BindingDB:
Activity Spreadsheet -- Enzyme Inhibition Constant Data from BindingDB
Found 2 hits for monomerid = 474388
Target5-hydroxytryptamine receptor 7(Homo sapiens (Human))
Temple University
US Patent
LigandPNGBDBM474388(US10858368, Entry 8 | US11319327, Entry 8)
Affinity DataIC50:  46nM. Assay description: A stock concentration of 5 nM [3H]LSD (lysergic acid diethyl amide) is prepared in 50 mM Tris-HCl, 10 mM MgCl2, 1 mM EDTA, pH 7.4 (Assay Buffer). Ali...
Ligand InfoPC cidPC sid
In DepthDetails US Patent
Target5-hydroxytryptamine receptor 7(Homo sapiens (Human))
Temple University
US Patent
LigandPNGBDBM474388(US10858368, Entry 8 | US11319327, Entry 8)
Affinity DataIC50:  46nM. Assay description: A solution of the compound of the disclosure to be tested is prepared as a 1-mg/ml stock in Assay Buffer or DMSO according to its solubility. A simil...
Ligand InfoPC cidPC sid
In DepthDetails US Patent