BDBM474415 1-({[(3R)-3-(4-Fluoro-1H-pyrazol-1-yl)-1-oxa-8-azaspiro[4.5]dec-8-yl]carbonyl}oxy)pyrrolidine-2,5-dione ::US10858373, Example 13
SMILES Fc1cnn(c1)[C@H]1COC2(C1)CCN(CC2)C(=O)ON1C(=O)CCC1=O
InChI Key InChIKey=QMJYILXMMOPQTQ-GFCCVEGCSA-N
Data  2 IC50
  Tab Delimited (TSV)   2D SDfile   Computed 3D by Vconf -m prep SDfile
Find this compound or compounds like it in BindingDB:
Activity Spreadsheet -- Enzyme Inhibition Constant Data from BindingDB
Found 2 hits for monomerid = 474415
TargetMonoglyceride lipase(Homo sapiens (Human))
Pfizer
US Patent
LigandPNGBDBM474415(1-({[(3R)-3-(4-Fluoro-1H-pyrazol-1-yl)-1-oxa-8-aza...)
Affinity DataIC50:  121nM. Assay description: T = 30 minutes.
Ligand InfoPC cidPC sid
In DepthDetails US Patent
TargetMonoglyceride lipase(Homo sapiens (Human))
Pfizer
US Patent
LigandPNGBDBM474415(1-({[(3R)-3-(4-Fluoro-1H-pyrazol-1-yl)-1-oxa-8-aza...)
Affinity DataIC50:  1.95E+3nM. Assay description: Assessment of MAGL inhibition utilizes human recombinant Monoacylglycerol Lipase and the fluorogenic substrate 7-hydroxycoumarinyl arachidonate (7-HC...
Ligand InfoPC cidPC sid
In DepthDetails US Patent