BDBM474440 US10858373, Example 38
SMILES CC(C)CS(=O)(=O)N(C)C1COC2(C1)CCN(CC2)C(=O)OC(C(F)(F)F)C(F)(F)F
InChI Key InChIKey=YNBBUEBDLPNKJY-UHFFFAOYSA-N
Data  2 IC50
  Tab Delimited (TSV)   2D SDfile   Computed 3D by Vconf -m prep SDfile
Find this compound or compounds like it in BindingDB:
Activity Spreadsheet -- Enzyme Inhibition Constant Data from BindingDB
Found 2 hits for monomerid = 474440
TargetMonoglyceride lipase(Homo sapiens (Human))
Pfizer
US Patent
LigandPNGBDBM474440(US10858373, Example 38)
Affinity DataIC50:  2.19nM. Assay description: T = 30 minutes.
Ligand InfoPC cidPC sid
In DepthDetails US Patent
TargetMonoglyceride lipase(Homo sapiens (Human))
Pfizer
US Patent
LigandPNGBDBM474440(US10858373, Example 38)
Affinity DataIC50:  22nM. Assay description: Assessment of MAGL inhibition utilizes human recombinant Monoacylglycerol Lipase and the fluorogenic substrate 7-hydroxycoumarinyl arachidonate (7-HC...
Ligand InfoPC cidPC sid
In DepthDetails US Patent