BDBM47485 1-(3-methylphenyl)-2,5-bis(oxidanylidene)dipyrido[1,2-d:3',4'-f]pyrimidine-3-carbonitrile::1-(3-methylphenyl)-2,5-dioxo-3-dipyrido[1,2-d:3',4'-f]pyrimidinecarbonitrile::1-(3-methylphenyl)-2,5-dioxodipyrido[1,2-d:3',4'-f]pyrimidine-3-carbonitrile::2,5-diketo-1-(m-tolyl)dipyrido[1,2-d:3',4'-f]pyrimidine-3-carbonitrile::MLS000520594::SMR000131005::cid_9550767
SMILES Cc1cccc(c1)-n1c2nc3ccccn3c(=O)c2cc(C#N)c1=O
InChI Key InChIKey=VSTCJSDHMGSFMA-UHFFFAOYSA-N
Data  1 IC50  1 EC50
  Tab Delimited (TSV)   2D SDfile   Computed 3D by Vconf -m prep SDfile
Find this compound or compounds like it in BindingDB:
Activity Spreadsheet -- Enzyme Inhibition Constant Data from BindingDB
Found 2 hits for monomerid = 47485
TargetdTDP-4-dehydrorhamnose 3,5-epimerase(Mycobacterium tuberculosis H37Rv)
Pcmd
Curated by PubChem BioAssay
LigandPNGBDBM47485(1-(3-methylphenyl)-2,5-bis(oxidanylidene)dipyrido[...)
Affinity DataIC50:  2.40E+3nM. Assay description: Molecular Library Screening Center Network (MLSCN) Penn Center for Molecular Discovery (PCMD) Assay Provider: Michael McNeil, Colorado State Universi...
In DepthDetails PCBioAssay
TargetSphingosine 1-phosphate receptor 1(Homo sapiens (Human))
The Scripps Research Institute Molecular Screening Center
Curated by PubChem BioAssay
LigandPNGBDBM47485(1-(3-methylphenyl)-2,5-bis(oxidanylidene)dipyrido[...)
Affinity DataEC50:  8.75E+3nM. Assay description: Source (MLPCN Center Name): The Scripps Research Institute Molecular Screening Center (SRIMSC) Center Affiliation: The Scripps Research Institute (TS...
In DepthDetails PCBioAssay