BDBM47494 4-[3-(4-methoxyphenyl)-5-thiophen-2-yl-3,4-dihydropyrazol-2-yl]benzaldehyde::4-[5-(4-methoxyphenyl)-3-(2-thienyl)-2-pyrazolin-1-yl]benzaldehyde::4-[5-(4-methoxyphenyl)-3-(2-thienyl)-4,5-dihydro-1H-pyrazol-1-yl]benzaldehyde::MLS000680495::SMR000268672::cid_2891826
SMILES COc1ccc(cc1)C1CC(=NN1c1ccc(C=O)cc1)c1cccs1
InChI Key InChIKey=MZDSEIRRZDSIKG-UHFFFAOYSA-N
Data  2 IC50  3 EC50
  Tab Delimited (TSV)   2D SDfile   Computed 3D by Vconf -m prep SDfile
Find this compound or compounds like it in BindingDB:
Activity Spreadsheet -- Enzyme Inhibition Constant Data from BindingDB
Found 5 hits for monomerid = 47494
TargetSphingosine 1-phosphate receptor 1(Homo sapiens (Human))
The Scripps Research Institute Molecular Screening Center
Curated by PubChem BioAssay
LigandPNGBDBM47494(4-[3-(4-methoxyphenyl)-5-thiophen-2-yl-3,4-dihydro...)
Affinity DataEC50:  1.25E+4nM. Assay description: Source (MLPCN Center Name): The Scripps Research Institute Molecular Screening Center (SRIMSC) Center Affiliation: The Scripps Research Institute (TS...
In DepthDetails PCBioAssay
TargetGlycoprotein 42(Human herpesvirus 4 type 2)
Emory University
Curated by PubChem BioAssay
LigandPNGBDBM47494(4-[3-(4-methoxyphenyl)-5-thiophen-2-yl-3,4-dihydro...)
Affinity DataIC50:  9.80E+3nM. Assay description: NIH Molecular Libraries Screening Centers Network [MLSCN] Emory Chemical Biology Discovery Center in MLSCN Assay provider: Theodore Jardetzky; Northw...
In DepthDetails PCBioAssay
TargetInsulin-degrading enzyme(Homo sapiens (Human))
The Scripps Research Institute Molecular Screening Center
Curated by PubChem BioAssay
LigandPNGBDBM47494(4-[3-(4-methoxyphenyl)-5-thiophen-2-yl-3,4-dihydro...)
Affinity DataIC50: >5.59E+4nM. Assay description: Source (MLPCN Center Name): The Scripps Research Institute Molecular Screening Center (SRIMSC) Center Affiliation: The Scripps Research Institute (TS...
In DepthDetails PCBioAssay
TargetZinc finger protein mex-5(Caenorhabditis elegans)
Broad Institute
Curated by PubChem BioAssay
LigandPNGBDBM47494(4-[3-(4-methoxyphenyl)-5-thiophen-2-yl-3,4-dihydro...)
Affinity DataEC50:  2.46E+4nM. Assay description: Broad Institute: MLPCN maternal gene expression Project ID: 2024 Keywords: Zinc finger, C. elegans, maternal gene expression, RNA-protein interac...
In DepthDetails PCBioAssay
TargetPOsterior Segregation(Caenorhabditis elegans)
Broad Institute
Curated by PubChem BioAssay
LigandPNGBDBM47494(4-[3-(4-methoxyphenyl)-5-thiophen-2-yl-3,4-dihydro...)
Affinity DataEC50:  1.83E+4nM. Assay description: Broad Institute: MLPCN maternal gene expression Project ID: 2024 Keywords: Zinc finger, C. elegans, maternal gene expression, RNA-protein interac...
In DepthDetails PCBioAssay