BDBM475041 US10849901, Compound 91
SMILES CS(=O)(=O)c1ccc(cc1)-c1cc(=O)n2nc(C3CC3)c(-c3ccc(Cl)cc3)c2[nH]1
InChI Key InChIKey=WJDXEEOALMYPDP-UHFFFAOYSA-N
Data  1 IC50
  Tab Delimited (TSV)   2D SDfile   Computed 3D by Vconf -m prep SDfile
Find this compound or compounds like it in BindingDB:
Activity Spreadsheet -- Enzyme Inhibition Constant Data from BindingDB
Found 1 hit for monomerid = 475041
TargetADP-ribosylation factor 6(Human)
Navigen
US Patent
LigandPNGBDBM475041(US10849901, Compound 91)
Affinity DataIC50:  7.90nM. Assay description: The primary biochemical assay uses a fluorometric assay for monitoring the replacement of bound nucleotide with a fluorogenic GTP derivative bearing ...
Ligand InfoPC cidPC sid
In DepthDetails US Patent