BDBM475046 US10849901, Compound 96
SMILES CCS(=O)(=O)Nc1ccc(cc1)-c1cc(=O)n2nc(C)c(-c3ccc(Cl)cc3)c2[nH]1
InChI Key InChIKey=OHNFLWRGHXHXOC-UHFFFAOYSA-N
Data  1 IC50
  Tab Delimited (TSV)   2D SDfile   Computed 3D by Vconf -m prep SDfile
Find this compound or compounds like it in BindingDB:
Activity Spreadsheet -- Enzyme Inhibition Constant Data from BindingDB
Found 1 hit for monomerid = 475046
TargetADP-ribosylation factor 6(Human)
Navigen
US Patent
LigandPNGBDBM475046(US10849901, Compound 96)
Affinity DataIC50:  10nM. Assay description: The primary biochemical assay uses a fluorometric assay for monitoring the replacement of bound nucleotide with a fluorogenic GTP derivative bearing ...
Ligand InfoPC cidPC sid
In DepthDetails US Patent