BDBM475092 US10849901, Compound 142
SMILES Fc1ccc(cc1)C1=CCN(CC1)c1nc(nc2CNCc12)-c1ccncc1
InChI Key InChIKey=WOPVZFYCLLKEQU-UHFFFAOYSA-N
Data  1 IC50
  Tab Delimited (TSV)   2D SDfile   Computed 3D by Vconf -m prep SDfile
Find this compound or compounds like it in BindingDB:
Activity Spreadsheet -- Enzyme Inhibition Constant Data from BindingDB
Found 1 hit for monomerid = 475092
TargetADP-ribosylation factor 6(Human)
Navigen
US Patent
LigandPNGBDBM475092(US10849901, Compound 142)
Affinity DataIC50:  1.20nM. Assay description: The primary biochemical assay uses a fluorometric assay for monitoring the replacement of bound nucleotide with a fluorogenic GTP derivative bearing ...
Ligand InfoPC cidPC sid
In DepthDetails US Patent