BDBM475435 2-(4-Carboxy-pyrazol-1-yl)-1H-benzoimidazole-5-::US10851083, Example 47::US11618744, Example 47
SMILES OC(=O)c1cnn(c1)-c1nc2cc(ccc2[nH]1)C(O)=O
InChI Key InChIKey=AXFPCYAFZVFLLG-UHFFFAOYSA-N
Data  2 IC50
  Tab Delimited (TSV)   2D SDfile   Computed 3D by Vconf -m prep SDfile
Find this compound or compounds like it in BindingDB:
Activity Spreadsheet -- Enzyme Inhibition Constant Data from BindingDB
Found 2 hits for monomerid = 475435
TargetEgl nine homolog 1 [181-417](Homo sapiens (Human))
Janssen Pharmaceutica
US Patent
LigandPNGBDBM475435(2-(4-Carboxy-pyrazol-1-yl)-1H-benzoimidazole-5- | ...)
Affinity DataIC50:  251nM. Assay description: The PHD2 181-417 polypeptide (3 μg) was pre-incubated for 30 minutes with test compound prior to assessing the enzymatic activity of the polypep...
Ligand InfoPC cidPC sid
In DepthDetails US Patent
TargetEgl nine homolog 1 [181-417](Homo sapiens (Human))
Janssen Pharmaceutica
US Patent
LigandPNGBDBM475435(2-(4-Carboxy-pyrazol-1-yl)-1H-benzoimidazole-5- | ...)
Affinity DataIC50:  251nM. Assay description: The PHD2181-417 polypeptide (3 μg) was pre-incubated for 30 minutes with test compound prior to assessing the enzymatic activity of the polypept...
Ligand InfoPC cidPC sid
In DepthDetails US Patent