BDBM475578 US10851089, Compound FC-8
SMILES Cc1cccc(COc2ccc(Sc3ccoc3C3(C)NC(=O)NC3=O)cc2)c1
InChI Key InChIKey=FAMHJGIKAOFUJI-UHFFFAOYSA-N
Data  1 IC50
  Tab Delimited (TSV)   2D SDfile   Computed 3D by Vconf -m prep SDfile
Find this compound or compounds like it in BindingDB:
Activity Spreadsheet -- Enzyme Inhibition Constant Data from BindingDB
Found 1 hit for monomerid = 475578
TargetMacrophage metalloelastase(Homo sapiens (Human))
Foresee Pharmaceuticals
US Patent
LigandPNGBDBM475578(US10851089, Compound FC-8)
Affinity DataIC50: <500nM. Assay description: The inhibitory effect of compounds on the rate of cleaving fluorogenic MMP substrate (Enzo, BML-P128) by recombinant human MMP-12 catalytic domain (E...
Ligand InfoPC cidPC sid
In DepthDetails US Patent