BDBM475684 6- [(4aR*,8aS*)- 8a-methyl-7- (7H- pyrrolo[2,3- d]pyrimidin-4- yl)- 3,4,4a,5,6,8- hexahydro-1H- 2,7- naphthyridin-2- yl]pyridazine- 3-carbonitrile::US10851116, Example 6
SMILES C[C@]12CN(CC[C@H]1CCN(C2)c1ncnc2[nH]ccc12)c1ccc(nn1)C#N
InChI Key
Data  4 EC50
  Tab Delimited (TSV)   2D SDfile   Computed 3D by Vconf -m prep SDfile
Find this compound or compounds like it in BindingDB:
Activity Spreadsheet -- Enzyme Inhibition Constant Data from BindingDB
Found 4 hits for monomerid = 475684
TargetTyrosine-protein kinase JAK1(Homo sapiens (Human))
Leo Pharma
US Patent
LigandPNGBDBM475684(6- [(4aR*,8aS*)- 8a-methyl-7- (7H- pyrrolo[2,3- d]...)
Affinity DataEC50:  17nM. Assay description: Inhibition of phosphorylation of a synthetic peptide was measured in an HTRF-based assay using the TK substrate-Biotin from the Cisbio HTRFKinEASE TK...
Ligand InfoPC cidPC sid
In DepthDetails US Patent
TargetNon-receptor tyrosine-protein kinase TYK2(Homo sapiens (Human))
Leo Pharma
US Patent
LigandPNGBDBM475684(6- [(4aR*,8aS*)- 8a-methyl-7- (7H- pyrrolo[2,3- d]...)
Affinity DataEC50:  634nM. Assay description: Inhibition of phosphorylation of a synthetic peptide was measured in an HTRF-based assay using the TK substrate-Biotin from the Cisbio HTRFKinEASE TK...
Ligand InfoPC cidPC sid
In DepthDetails US Patent
TargetTyrosine-protein kinase JAK3(Homo sapiens (Human))
Leo Pharma
US Patent
LigandPNGBDBM475684(6- [(4aR*,8aS*)- 8a-methyl-7- (7H- pyrrolo[2,3- d]...)
Affinity DataEC50:  9nM. Assay description: Inhibition of phosphorylation of a synthetic peptide was measured in an HTRF-based assay using the TK substrate-Biotin from the Cisbio HTRFKinEASE TK...
Ligand InfoPC cidPC sid
In DepthDetails US Patent
TargetTyrosine-protein kinase JAK2(Homo sapiens (Human))
Leo Pharma
US Patent
LigandPNGBDBM475684(6- [(4aR*,8aS*)- 8a-methyl-7- (7H- pyrrolo[2,3- d]...)
Affinity DataEC50:  64nM. Assay description: Inhibition of phosphorylation of a synthetic peptide was measured in an HTRF-based assay using the TK substrate-Biotin from the Cisbio HTRFKinEASE TK...
Ligand InfoPC cidPC sid
In DepthDetails US Patent