BDBM475706 (3aR,7aR)-3a-methyl-5-(7H-pyrrolo[2,3-d]pyrimidin-4-yl)-1,3,4,6,7,7a-hexahydropyrrolo[3,4-c]pyridine-2-carbonitrile ::US10851116, Example 28
SMILES C[C@@]12CN(C[C@@H]1CCN(C2)c1ncnc2[nH]ccc12)C#N
InChI Key
Data  4 EC50
  Tab Delimited (TSV)   2D SDfile   Computed 3D by Vconf -m prep SDfile
Find this compound or compounds like it in BindingDB:
Activity Spreadsheet -- Enzyme Inhibition Constant Data from BindingDB
Found 4 hits for monomerid = 475706
TargetTyrosine-protein kinase JAK1(Homo sapiens (Human))
Leo Pharma
US Patent
LigandPNGBDBM475706((3aR,7aR)-3a-methyl-5-(7H-pyrrolo[2,3-d]pyrimidin-...)
Affinity DataEC50:  240nM. Assay description: Inhibition of phosphorylation of a synthetic peptide was measured in an HTRF-based assay using the TK substrate-Biotin from the Cisbio HTRFKinEASE TK...
Ligand InfoPC cidPC sid
In DepthDetails US Patent
TargetNon-receptor tyrosine-protein kinase TYK2(Homo sapiens (Human))
Leo Pharma
US Patent
LigandPNGBDBM475706((3aR,7aR)-3a-methyl-5-(7H-pyrrolo[2,3-d]pyrimidin-...)
Affinity DataEC50:  2.47E+3nM. Assay description: Inhibition of phosphorylation of a synthetic peptide was measured in an HTRF-based assay using the TK substrate-Biotin from the Cisbio HTRFKinEASE TK...
Ligand InfoPC cidPC sid
In DepthDetails US Patent
TargetTyrosine-protein kinase JAK3(Homo sapiens (Human))
Leo Pharma
US Patent
LigandPNGBDBM475706((3aR,7aR)-3a-methyl-5-(7H-pyrrolo[2,3-d]pyrimidin-...)
Affinity DataEC50:  2.18E+3nM. Assay description: Inhibition of phosphorylation of a synthetic peptide was measured in an HTRF-based assay using the TK substrate-Biotin from the Cisbio HTRFKinEASE TK...
Ligand InfoPC cidPC sid
In DepthDetails US Patent
TargetTyrosine-protein kinase JAK2(Homo sapiens (Human))
Leo Pharma
US Patent
LigandPNGBDBM475706((3aR,7aR)-3a-methyl-5-(7H-pyrrolo[2,3-d]pyrimidin-...)
Affinity DataEC50:  827nM. Assay description: Inhibition of phosphorylation of a synthetic peptide was measured in an HTRF-based assay using the TK substrate-Biotin from the Cisbio HTRFKinEASE TK...
Ligand InfoPC cidPC sid
In DepthDetails US Patent