BDBM475768 3-[(3aS,3bR,6aS,6bR)-5-(1H- benzotriazole-5-carbonyl)-octahydro- cyclobuta[1,2-c;3,4-c']dipyrrole-2- carbonyl]-3,4-dihydro-2H-naphthalen-1- one::US10849881, Example 1.041
SMILES O=C(C1CC(=O)c2ccccc2C1)N1C[C@H]2[C@@H](C1)[C@@H]1CN(C[C@H]21)C(=O)c1ccc2[nH]nnc2c1
InChI Key
Data  1 IC50
  Tab Delimited (TSV)   2D SDfile   Computed 3D by Vconf -m prep SDfile
Find this compound or compounds like it in BindingDB:
Activity Spreadsheet -- Enzyme Inhibition Constant Data from BindingDB
Found 1 hit for monomerid = 475768
TargetAtaxin-1(Homo sapiens (Human))
Hoffmann-La Roche
US Patent
LigandPNGBDBM475768(3-[(3aS,3bR,6aS,6bR)-5-(1H- benzotriazole-5-carbon...)
Affinity DataIC50:  538nM. Assay description: ATX inhibition was measured by a fluorescence quenching assay using a specifically labeled substrate analogue (MR121 substrate). To obtain this MR121...
Ligand InfoPC cidPC sid
In DepthDetails US Patent