BDBM475834 (1H-benzotriazol-5-yl)- {(3aS,3bR,6aS,6bR)-5-[4-(4-chloro- phenyl)-5-(2,2,2-trifluoro-ethoxy)- pyridine-2-carbonyl]-octahydro- cyclobuta[1,2-c;3,4-c']dipyrrol-2-yl}- methanone::US10849881, Example 1.107
SMILES FC(F)(F)COc1cnc(cc1-c1ccc(Cl)cc1)C(=O)N1C[C@H]2[C@@H]3CN(C[C@@H]3[C@H]2C1)C(=O)c1ccc2NNNc2c1
InChI Key InChIKey=UYRBHRZXBVVHFE-ZDNVTZCJSA-N
Data  1 IC50
  Tab Delimited (TSV)   2D SDfile   Computed 3D by Vconf -m prep SDfile
Find this compound or compounds like it in BindingDB:
Activity Spreadsheet -- Enzyme Inhibition Constant Data from BindingDB
Found 1 hit for monomerid = 475834
TargetAtaxin-1(Homo sapiens (Human))
Hoffmann-La Roche
US Patent
LigandPNGBDBM475834((1H-benzotriazol-5-yl)- {(3aS,3bR,6aS,6bR)-5-[4-(4...)
Affinity DataIC50:  141nM. Assay description: ATX inhibition was measured by a fluorescence quenching assay using a specifically labeled substrate analogue (MR121 substrate). To obtain this MR121...
Ligand InfoPC cidPC sid
In DepthDetails US Patent