BDBM475860 US10864201, Ex. 5.1
SMILES C[C@@]1(Cc2cc(cnc2N1)C(=O)N1CCC2(C1)CCOCC2)c1ccc(F)cc1
InChI Key InChIKey=PBKUOCNHEULCRA-JOCHJYFZSA-N
Data  1 IC50
  Tab Delimited (TSV)   2D SDfile   Computed 3D by Vconf -m prep SDfile
Find this compound or compounds like it in BindingDB:
Activity Spreadsheet -- Enzyme Inhibition Constant Data from BindingDB
Found 1 hit for monomerid = 475860
TargetPantetheinase(Homo sapiens (Human))
Boehringer Ingelheim International
US Patent
LigandPNGBDBM475860(US10864201, Ex. 5.1)
Affinity DataIC50:  0.400nM. Assay description: The test compounds are dissolved in 100% DMSO at a concentration of 10 mM and in a first step diluted in DMSO to a concentration of 5 mM, followed by...
Ligand InfoPC cidPC sid
In DepthDetails US Patent