BDBM475887 N-[(3S)-1-[(2R)-2-(4-Cyanophenyl)-2-methyl-1H,2H,3H-pyrrolo[2,3-b]pyridine-5-carbonyl]pyrrolidin-3-yl]-N-methylacetamide::US10864201, Ex. 10
SMILES CN([C@H]1CCN(C1)C(=O)c1cnc2N[C@](C)(Cc2c1)c1ccc(cc1)C#N)C(C)=O
InChI Key InChIKey=JYYRCGWDPRZBHD-NZQKXSOJSA-N
Data  1 IC50
  Tab Delimited (TSV)   2D SDfile   Computed 3D by Vconf -m prep SDfile
Find this compound or compounds like it in BindingDB:
Activity Spreadsheet -- Enzyme Inhibition Constant Data from BindingDB
Found 1 hit for monomerid = 475887
TargetPantetheinase(Homo sapiens (Human))
Boehringer Ingelheim International
US Patent
LigandPNGBDBM475887(N-[(3S)-1-[(2R)-2-(4-Cyanophenyl)-2-methyl-1H,2H,3...)
Affinity DataIC50:  0.200nM. Assay description: The test compounds are dissolved in 100% DMSO at a concentration of 10 mM and in a first step diluted in DMSO to a concentration of 5 mM, followed by...
Ligand InfoPC cidPC sid
In DepthDetails US Patent