BDBM475903 US10864201, Ex. 12.4
SMILES CN([C@H]1CCN(C1)C(=O)c1cnc2NC(C)(C)CCCc2c1)C(C)=O
InChI Key InChIKey=OSISRSAJKDKLHC-INIZCTEOSA-N
Data  1 IC50
  Tab Delimited (TSV)   2D SDfile   Computed 3D by Vconf -m prep SDfile
Find this compound or compounds like it in BindingDB:
Activity Spreadsheet -- Enzyme Inhibition Constant Data from BindingDB
Found 1 hit for monomerid = 475903
TargetPantetheinase(Homo sapiens (Human))
Boehringer Ingelheim International
US Patent
LigandPNGBDBM475903(US10864201, Ex. 12.4)
Affinity DataIC50:  2.5nM. Assay description: The test compounds are dissolved in 100% DMSO at a concentration of 10 mM and in a first step diluted in DMSO to a concentration of 5 mM, followed by...
Ligand InfoPC cidPC sid
In DepthDetails US Patent