BDBM47593 MLS000587449::N-[1-Benzo[1,3]dioxol-5-ylmethyl-2-oxo-1,2-dihydro-indol-(3Z)-ylidene-hydrazinocarbonylmethyl]-2-phenyl-acetamide::N-[2-[(2Z)-2-[1-(1,3-benzodioxol-5-ylmethyl)-2-oxidanylidene-indol-3-ylidene]hydrazinyl]-2-oxidanylidene-ethyl]-2-phenyl-ethanamide::N-[2-[(2Z)-2-[1-(1,3-benzodioxol-5-ylmethyl)-2-oxo-3-indolylidene]hydrazinyl]-2-oxoethyl]-2-phenylacetamide::N-[2-[(2Z)-2-[1-(1,3-benzodioxol-5-ylmethyl)-2-oxoindol-3-ylidene]hydrazinyl]-2-oxoethyl]-2-phenylacetamide::N-[2-keto-2-[(N'Z)-N'-(2-keto-1-piperonyl-indolin-3-ylidene)hydrazino]ethyl]-2-phenyl-acetamide::SMR000211502::cid_5912542
SMILES O=C(CNC(=O)Cc1ccccc1)N\N=C1/C(=O)N(Cc2ccc3OCOc3c2)c2ccccc12
InChI Key InChIKey=MZVWWDCUHCPIPX-GNVQSUKOSA-N
Data  1 EC50
  Tab Delimited (TSV)   2D SDfile   Computed 3D by Vconf -m prep SDfile
Find this compound or compounds like it in BindingDB:
Activity Spreadsheet -- Enzyme Inhibition Constant Data from BindingDB
Found 1 hit for monomerid = 47593
TargetGlutathione S-transferase Mu 1(Homo sapiens (Human))
Nmmlsc
Curated by PubChem BioAssay
LigandPNGBDBM47593(MLS000587449 | N-[1-Benzo[1,3]dioxol-5-ylmethyl-2-...)
Affinity DataEC50:  1.20E+4nM. Assay description: University of New Mexico Assay Overview: Assay Support: NIH I RO3 MH081231-01 HTS to identify specific small molecule inhibitors of Ras and Ras-re...
In DepthDetails PCBioAssay