BDBM475934 Preparation of (2S,6R,11R)-8-((4-(2,5,8,11,14-pentaoxahexadecan-16-ylamino)phenyl)amino)-3-(cyclopropylmethyl)-6,11-dimethyl-3,4,5,6-tetrahydro-2,6-methanobenzo[d]azocin-1(2H)-one ::US10865186, Compound 12
SMILES COCCOCCCCCOCCOCCNc1ccc(Nc2ccc3C(=O)C4[C@H](C)[C@@](C)(CCN4CC4CC4)c3c2)cc1
InChI Key InChIKey=CICHZWIBBWACSO-GLPZOKSMSA-N
Data  2 KI
  Tab Delimited (TSV)   2D SDfile   Computed 3D by Vconf -m prep SDfile
Find this compound or compounds like it in BindingDB:
Activity Spreadsheet -- Enzyme Inhibition Constant Data from BindingDB
Found 2 hits for monomerid = 475934
TargetKappa-type opioid receptor(Homo sapiens (Human))
Nektar Therapeutics
US Patent
LigandPNGBDBM475934(Preparation of (2S,6R,11R)-8-((4-(2,5,8,11,14-pent...)
Affinity DataKi:  5nM. Assay description: The binding affinities of certain compounds of the present invention were evaluated using radioligand binding assays in membranes prepared from CHO-K...
Ligand InfoPC cidPC sid
In DepthDetails US Patent
TargetMu-type opioid receptor(Homo sapiens (Human))
Nektar Therapeutics
US Patent
LigandPNGBDBM475934(Preparation of (2S,6R,11R)-8-((4-(2,5,8,11,14-pent...)
Affinity DataKi:  58.5nM
Ligand InfoPC cidPC sid
In DepthDetails US Patent