BDBM476235 US10874634, Cmpd No. 17::US11364220, Compound 17
SMILES CCC(CC)(C(O)=O)c1ccc(NS(=O)(=O)c2ccc3c(c2)C(C)(C)CCC3(C)C)cc1
InChI Key InChIKey=YICMNMYTJJNEQA-UHFFFAOYSA-N
Data  4 IC50
  Tab Delimited (TSV)   2D SDfile   Computed 3D by Vconf -m prep SDfile
Find this compound or compounds like it in BindingDB:
Activity Spreadsheet -- Enzyme Inhibition Constant Data from BindingDB
Found 4 hits for monomerid = 476235
TargetCytochrome P450 26A1(Homo sapiens (Human))
Queens University At Kingston
US Patent
LigandPNGBDBM476235(US10874634, Cmpd No. 17 | US11364220, Compound 17)
Affinity DataIC50:  3.87E+4nM. Assay description: CYP26A1 or CYP26B1 stably transfected HeLa cells were maintained in Minimum Essential Medium (MEM) containing 10% fetal bovine serum (FBS) and 100 &#...
Ligand InfoPC cidPC sid
In DepthDetails US Patent
TargetCytochrome P450 26B1(Homo sapiens (Human))
Queens University At Kingston
US Patent
LigandPNGBDBM476235(US10874634, Cmpd No. 17 | US11364220, Compound 17)
Affinity DataIC50:  290nM. Assay description: This retinoid activity assay measures the ability of test compounds to induce expression of a transiently transfected RA sensitive reporter construct...
Ligand InfoPC cidPC sid
In DepthDetails US Patent
TargetCytochrome P450 26A1(Homo sapiens (Human))
Queens University At Kingston
US Patent
LigandPNGBDBM476235(US10874634, Cmpd No. 17 | US11364220, Compound 17)
Affinity DataIC50:  3.87E+4nM. Assay description: This retinoid activity assay measures the ability of test compounds to induce expression of a transiently transfected RA sensitive reporter construct...
Ligand InfoPC cidPC sid
In DepthDetails US Patent
TargetCytochrome P450 26B1(Homo sapiens (Human))
Queens University At Kingston
US Patent
LigandPNGBDBM476235(US10874634, Cmpd No. 17 | US11364220, Compound 17)
Affinity DataIC50:  290nM. Assay description: CYP26A1 or CYP26B1 stably transfected HeLa cells were maintained in Minimum Essential Medium (MEM) containing 10% fetal bovine serum (FBS) and 100 &#...
Ligand InfoPC cidPC sid
In DepthDetails US Patent