BDBM476286 US10874640, Compound 48
SMILES Cc1c(C(=O)C(=O)NC2(CC(F)(F)C2)c2cnn[nH]2)c2C[C@@H](F)Cn2c1C(=O)Nc1ccc(F)cc1
InChI Key
Data  1 EC50
  Tab Delimited (TSV)   2D SDfile   Computed 3D by Vconf -m prep SDfile
Find this compound or compounds like it in BindingDB:
Activity Spreadsheet -- Enzyme Inhibition Constant Data from BindingDB
Found 1 hit for monomerid = 476286
TargetCapsid protein(Hepatitis B virus genotype C subtype ayr (isolate ...)
Gilead Sciences
US Patent
LigandPNGBDBM476286(US10874640, Compound 48)
Affinity DataEC50:  6.5nM. Assay description: A HepG2 cell line overexpressing the HBV virus attachment receptor sodium-taurocholate cotransporting polypeptide (NTCP) was grown to confluency in D...
Ligand InfoPC cidPC sid
In DepthDetails US Patent