BDBM476364 US10875851, Example 20::isoquinolin-7-yl (3S)-4-(N,3- dicyclohexyl-D-alanyl)-3-[(thiophen- 2-ylmethyl)carbamoyl]piperazine-1- carboxylate
SMILES O=C(NCc1cccs1)[C@@H]1CN(CCN1C(=O)[C@@H](CC1CCCCC1)NC1CCCCC1)C(=O)Oc1ccc2ccncc2c1
InChI Key InChIKey=ZDJUOTRIPBQSDA-ZWXJPIIXSA-N
Data  1 IC50
  Tab Delimited (TSV)   2D SDfile   Computed 3D by Vconf -m prep SDfile
Find this compound or compounds like it in BindingDB:
Activity Spreadsheet -- Enzyme Inhibition Constant Data from BindingDB
Found 1 hit for monomerid = 476364
TargetCoagulation factor XII(Homo sapiens (Human))
Merck Sharp & Dohme
US Patent
LigandPNGBDBM476364(US10875851, Example 20 | isoquinolin-7-yl (3S)-4-(...)
Affinity DataIC50:  29.1nM. Assay description: The effectiveness of a compound of the present invention as an inhibitor of Coagulation Factor XIIa can be determined using a relevant purified serin...
Ligand InfoPC cidPC sid
In DepthDetails US Patent