BDBM476382 1,2,3,4-tetrahydroisoquinolin-6-yl (3S)-4-(N,3-dicyclohexyl-D-alanyl)-3- [(thiophen-2- ylmethyl)carbamoyl]piperazine-1- carboxylate::US10875851, Example 38
SMILES O=C(NCc1cccs1)[C@@H]1CN(CCN1C(=O)[C@@H](CC1CCCCC1)NC1CCCCC1)C(=O)Oc1ccc2CNCCc2c1
InChI Key InChIKey=CLYIIXRBQJYEET-ZWXJPIIXSA-N
Data  1 IC50
  Tab Delimited (TSV)   2D SDfile   Computed 3D by Vconf -m prep SDfile
Find this compound or compounds like it in BindingDB:
Activity Spreadsheet -- Enzyme Inhibition Constant Data from BindingDB
Found 1 hit for monomerid = 476382
TargetCoagulation factor XII(Homo sapiens (Human))
Merck Sharp & Dohme
US Patent
LigandPNGBDBM476382(1,2,3,4-tetrahydroisoquinolin-6-yl (3S)-4-(N,3-dic...)
Affinity DataIC50:  18.7nM. Assay description: The effectiveness of a compound of the present invention as an inhibitor of Coagulation Factor XIIa can be determined using a relevant purified serin...
Ligand InfoPC cidPC sid
In DepthDetails US Patent