BDBM47649 4-[2,5-dimethyl-3-[(1-oxidanylidene-[1,3]thiazolo[3,2-a]benzimidazol-2-ylidene)methyl]pyrrol-1-yl]benzoic acid::4-[2,5-dimethyl-3-[(1-oxo-2-thiazolo[3,2-a]benzimidazolylidene)methyl]-1-pyrrolyl]benzoic acid::4-[2,5-dimethyl-3-[(1-oxo-[1,3]thiazolo[3,2-a]benzimidazol-2-ylidene)methyl]pyrrol-1-yl]benzoic acid::4-[3-[(1-ketothiazolo[3,2-a]benzimidazol-2-ylidene)methyl]-2,5-dimethyl-pyrrol-1-yl]benzoic acid::4-{2,5-dimethyl-3-[(Z)-(3-oxo[1,3]thiazolo[3,2-a]benzimidazol-2(3H)-ylidene)methyl]-1H-pyrrol-1-yl}benzoic acid::MLS000681758::SMR000312801::cid_4531488
SMILES Cc1cc(C=c2sc3nc4ccccc4n3c2=O)c(C)n1-c1ccc(cc1)C(O)=O
InChI Key InChIKey=WBRNYUCRCLWKMP-UHFFFAOYSA-N
Data  3 EC50
  Tab Delimited (TSV)   2D SDfile   Computed 3D by Vconf -m prep SDfile
Find this compound or compounds like it in BindingDB:
Activity Spreadsheet -- Enzyme Inhibition Constant Data from BindingDB
Found 3 hits for monomerid = 47649
TargetGlutathione S-transferase Mu 1(Homo sapiens (Human))
Nmmlsc
Curated by PubChem BioAssay
LigandPNGBDBM47649(4-[2,5-dimethyl-3-[(1-oxidanylidene-[1,3]thiazolo[...)
Affinity DataEC50:  4.75E+4nM. Assay description: University of New Mexico Assay Overview: Assay Support: NIH I RO3 MH081231-01 HTS to identify specific small molecule inhibitors of Ras and Ras-re...
In DepthDetails PCBioAssay
TargetZinc finger protein mex-5(Caenorhabditis elegans)
Broad Institute
Curated by PubChem BioAssay
LigandPNGBDBM47649(4-[2,5-dimethyl-3-[(1-oxidanylidene-[1,3]thiazolo[...)
Affinity DataEC50:  3.00E+5nM. Assay description: Broad Institute: MLPCN maternal gene expression Project ID: 2024 Keywords: Zinc finger, C. elegans, maternal gene expression, RNA-protein interac...
In DepthDetails PCBioAssay
TargetPOsterior Segregation(Caenorhabditis elegans)
Broad Institute
Curated by PubChem BioAssay
LigandPNGBDBM47649(4-[2,5-dimethyl-3-[(1-oxidanylidene-[1,3]thiazolo[...)
Affinity DataEC50:  3.00E+5nM. Assay description: Broad Institute: MLPCN maternal gene expression Project ID: 2024 Keywords: Zinc finger, C. elegans, maternal gene expression, RNA-protein interac...
In DepthDetails PCBioAssay