BDBM47651 1-(1-pyrrolidinyl)-2-[(3-thiophen-2-yl-[1,2,4]triazolo[4,3-b]pyridazin-6-yl)thio]ethanone::1-pyrrolidin-1-yl-2-[(3-thiophen-2-yl-[1,2,4]triazolo[4,3-b]pyridazin-6-yl)sulfanyl]ethanone::1-pyrrolidino-2-[[3-(2-thienyl)-[1,2,4]triazolo[4,3-b]pyridazin-6-yl]thio]ethanone::MLS000624284::SMR000323593::cid_7190321
SMILES O=C(CSc1ccc2nnc(-c3cccs3)n2n1)N1CCCC1
InChI Key InChIKey=ZDQYBNRAGANZJT-UHFFFAOYSA-N
Data  2 EC50
  Tab Delimited (TSV)   2D SDfile   Computed 3D by Vconf -m prep SDfile
Find this compound or compounds like it in BindingDB:
Activity Spreadsheet -- Enzyme Inhibition Constant Data from BindingDB
Found 2 hits for monomerid = 47651
TargetGlycogen synthase kinase-3 beta(Homo sapiens (Human))
Broad Institute
Curated by PubChem BioAssay
LigandPNGBDBM47651(1-(1-pyrrolidinyl)-2-[(3-thiophen-2-yl-[1,2,4]tria...)
Affinity DataEC50: >3.00E+5nM. Assay description: Keywords: GSK3beta, dose response, kinase, inhibition, HTS Assay Overview: The glycogen synthase kinase-3 beta (GSK-3b) is a known master regulator f...
In DepthDetails PCBioAssay
TargetGlutathione S-transferase Mu 1(Homo sapiens (Human))
Nmmlsc
Curated by PubChem BioAssay
LigandPNGBDBM47651(1-(1-pyrrolidinyl)-2-[(3-thiophen-2-yl-[1,2,4]tria...)
Affinity DataEC50:  1.30E+3nM. Assay description: University of New Mexico Assay Overview: Assay Support: NIH I RO3 MH081231-01 HTS to identify specific small molecule inhibitors of Ras and Ras-re...
In DepthDetails PCBioAssay