BDBM476518 (2S)-1-{N-[4- (aminomethyl)cyclohexyl]-6- piperidin-1-yl-D-norleucyl}-4- [(4S,5S)-4-methyl-5-phenyl-4,5- dihydro-1,3-oxazol-2-yl]-N- (thieno[3,2-c]pyridin-2- ylmethyl)piperazine-2-carboxamide::US10875851, Example 174
SMILES C[C@@H]1N=C(O[C@H]1c1ccccc1)N1CCN([C@@H](C1)C(=O)NCc1cc2cnccc2s1)C(=O)[C@@H](CCCCN1CCCCC1)NC1CCC(CN)CC1
InChI Key InChIKey=DQJSNRWXRWDWQC-GNLUFGTRSA-N
Data  1 IC50
  Tab Delimited (TSV)   2D SDfile   Computed 3D by Vconf -m prep SDfile
Find this compound or compounds like it in BindingDB:
Activity Spreadsheet -- Enzyme Inhibition Constant Data from BindingDB
Found 1 hit for monomerid = 476518
TargetCoagulation factor XII(Homo sapiens (Human))
Merck Sharp & Dohme
US Patent
LigandPNGBDBM476518((2S)-1-{N-[4- (aminomethyl)cyclohexyl]-6- piperidi...)
Affinity DataIC50:  3nM. Assay description: The effectiveness of a compound of the present invention as an inhibitor of Coagulation Factor XIIa can be determined using a relevant purified serin...
Ligand InfoPC cidPC sid
In DepthDetails US Patent