BDBM476680 (S)-6-(8-Bromodibenzo[b,d]thiophen- 2-yl)-2-imino-3,6-dimethyltetrahydro- pyrimidin-4(1H)-one::US10870635, Example 88
SMILES CN1C(=N)N[C@@](C)(CC1=O)c1ccc2sc3ccc(Br)cc3c2c1
InChI Key InChIKey=CQZXFAARULDROS-SFHVURJKSA-N
Data  1 IC50
  Tab Delimited (TSV)   2D SDfile   Computed 3D by Vconf -m prep SDfile
Find this compound or compounds like it in BindingDB:
Activity Spreadsheet -- Enzyme Inhibition Constant Data from BindingDB
Found 1 hit for monomerid = 476680
TargetBeta-secretase 1(Homo sapiens (Human))
Allgenesis Biotherapeutics
US Patent
LigandPNGBDBM476680((S)-6-(8-Bromodibenzo[b,d]thiophen- 2-yl)-2-imino-...)
Affinity DataIC50: >300nM. Assay description: A BACE1 activity assay kit from AnaSpec (Fremont, Calif.) was used to determine the potency of the selected BACE1 inhibitors by AnaSpec BACE1 fluores...
Ligand InfoPC cidPC sid
In DepthDetails US Patent