BDBM476726 US10870651, Compound 114
SMILES CN(C)C[C@@H](NC(=O)N1Cc2c(NC(=O)[C@H]3CCCN(C3)C(=O)C=C)n[nH]c2C1(C)C)c1ccccc1
InChI Key
Data  1 IC50
  Tab Delimited (TSV)   2D SDfile   Computed 3D by Vconf -m prep SDfile
Find this compound or compounds like it in BindingDB:
Activity Spreadsheet -- Enzyme Inhibition Constant Data from BindingDB
Found 1 hit for monomerid = 476726
TargetCDK-activating kinase assembly factor MAT1/Cyclin-H/Cyclin-dependent kinase 7(Homo sapiens (Human))
Dana-Farber Cancer Institute
US Patent
LigandPNGBDBM476726(US10870651, Compound 114)
Affinity DataIC50: <100nM. Assay description: Compounds of the invention were assayed for activity against a variety of different kinases.
Ligand InfoPC cidPC sid
In DepthDetails US Patent